{"text_format":"1","workbook":"xlsx","n_sheets":2,"sheets":["Tunnel med redusert standard","Menyer"],"not_rendered":{"charts":0,"images":0,"macros":1,"external_links":0,"defined_names":0,"comments":0,"pivot_tables":0},"unopened":[],"bounds":{"document_bytes":16777216,"sheet_cells":100000,"rows_first":2000,"rows_last":500,"rows_between":2000,"halvings":0,"cell_chars":16384,"cell_head_chars":4096},"cells_cut":0,"cells_raw":0,"read":"whole","date_system":"1900"}

{"sheet":"Tunnel med redusert standard","index":0,"n_rows":34,"n_cols":6,"rows_kept":34,"cut":false,"hidden":false,"merged":[[8,1,8,5],[19,1,19,3],[21,1,21,3],[23,1,23,3],[11,1,11,3],[13,1,13,3],[15,1,15,3],[16,1,16,3],[18,1,18,3],[9,1,9,3],[31,3,31,4],[32,3,32,4],[33,3,33,4],[30,2,30,4],[24,1,24,3],[25,1,25,3],[26,1,26,3],[28,1,28,3],[1,1,2,3],[3,1,3,3],[4,1,4,3],[5,1,5,3],[6,5,7,5],[6,1,6,4],[7,1,7,4]]}
[]
[null,"Statens vegvesen",null,null,"Kommune:"]
[null,null,null,null,"Tunnel:"]
[null,"Beregning av særskilte fartsgrenser i tunnel med redusert standard",null,null,"Vegnr:"]
[null,"60km/t - 80km/t",null,null,"Fra Hp:"]
[null,"ver.2.1",null,null,"Fra metrering:"]
[null,"Tunneler skal i utgangspunktet ha samme fartsgrense som tilknyttende veg i dagen. ",null,null,null,"Modellen bør ikke brukes på tunneler kortere enn 500 m jf. tunnelsikkerhetsforskriften"]
[null,"Tabellene under er basert på poengtildelingskriteriene definert i NA-2020/01 fartsgrensekriterier"]
[]
[null,"Beskrivelse",null,null,"Poenggiver","Poeng"]
[]
[null,"Kjørebanebredde (avstand mellom kantlinjene)",null,null,"6,5 m vegnormalstandard",{"$f":"INDEX(Menyer!A3:B6,MATCH('Tunnel med redusert standard'!E12,Menyer!A3:A6,0), 2)","v":0}]
[]
[null,"Fri høyde",null,null,"> 4,4 m",{"$f":"INDEX(Menyer!C3:D6,MATCH('Tunnel med redusert standard'!E14,Menyer!C3:C6,0), 2)","v":0}]
[]
[null,"Kurvatur",null,null,"Vegnormalstandard",{"$f":"INDEX(Menyer!E3:F6,MATCH('Tunnel med redusert standard'!E16,Menyer!E3:E6,0), 2)","v":0}]
[null,"Breddeutvidet for stoppsikt?",null,null,"Nei",{"$f":"INDEX(Menyer!G3:H4,MATCH('Tunnel med redusert standard'!E17,Menyer!G3:G4,0), 2)*F16","v":0}]
[]
[null,"Stigningsgrad i prosent",null,null," < 3%",{"$f":"INDEX(Menyer!I3:J7,MATCH('Tunnel med redusert standard'!E19,Menyer!I3:I7,0), 2)","v":0}]
[null,"Stigningslengde",null,null,"≤ 2 km",{"$f":"INDEX(Menyer!K3:L4,MATCH('Tunnel med redusert standard'!E20,Menyer!K3:K4,0), 2)","v":0}]
[]
[null,"Veglys",null,null,"Vegnormalstandard",{"$f":"INDEX(Menyer!M3:N5,MATCH('Tunnel med redusert standard'!E22,Menyer!M3:M5,0), 2)","v":0}]
[]
[null,"Trafikk"]
[null,"ÅDT > 8000",null,null,false,{"$f":"IF(E25=TRUE,Menyer!$P$3,Menyer!$P$2)","v":0}]
[null,"ÅDTT (3,5 t) > 15 %",null,null,false,{"$f":"IF(E26=TRUE,Menyer!$P$3,Menyer!$P$2)","v":0}]
[null,"Et lite antall gående- og syklende i tunnelen",null,null,false,{"$f":"IF(E27=TRUE,Menyer!$P$3,Menyer!$P$2)","v":0}]
[]
[null,"Sum poeng",null,null,{"$f":"SUM($F$12:$F$27)-$F$16","v":0}]
[]
[null,null,"Fartsgrense"]
[null,null,"80 km/t",{"$f":"INDEX(Menyer!Q4:R64,MATCH('Tunnel med redusert standard'!E29,Menyer!Q4:Q64,0), 2)","v":"Anbefalt fartsgrense"}]
[null,null,"70 km/t",{"$f":"INDEX(Menyer!S4:T64,MATCH('Tunnel med redusert standard'!E29,Menyer!S4:S64,0), 2)","v":"Fartsgrense som kan være aktuell dersom andre kriterier er oppfylt"}]
[null,null,"60 km/t",{"$f":"INDEX(Menyer!U4:V64,MATCH('Tunnel med redusert standard'!E29,Menyer!U4:U64,0), 2)","v":"Fartsgrense som kan være aktuell dersom andre kriterier er oppfylt"}]

{"sheet":"Menyer","index":1,"n_rows":64,"n_cols":22,"rows_kept":64,"cut":false,"hidden":true,"merged":[[0,8,0,9],[0,12,0,13],[0,0,0,1],[0,2,0,3],[0,4,0,5],[0,6,0,7],[0,10,0,11],[1,16,1,17],[1,18,1,19],[1,20,1,21],[0,16,0,21],[0,14,0,15]]}
["Kjørebanebredde",null,"Fri høyde",null,"Kurvatur",null,"Breddeutvidet for stoppsikt?",null,"Stigningsgrad (%)",null,"Stigningslengde",null,"Veglys",null,"Trafikk",null,"Tabell for valg av fartsgrense for tunnel"]
[null,"Poeng",null,"Poeng",null,"Poeng",null,"Poeng",null,"Poeng",null,"Poeng",null,"Poeng","Nei",0,80,null,70,null,60]
["6,5 m vegnormalstandard",0,"> 4,4 m",0,"Vegnormalstandard",0,"Nei",1," < 3%",0,"≤ 2 km",0,"Vegnormalstandard",0,"Ja",2,"Poeng","Konklusjon","Poeng",null,"Poeng"]
["> 6,0 m ",1,"4,2 - 4,4 m",1,"> 300 m",1,"Ja",0,"3,1 - 5 %",2,"> 2 km",2,"Under normalstandard",2,null,null,0,"Anbefalt fartsgrense",0,"Fartsgrense som kan være aktuell dersom andre kriterier er oppfylt",0,"Fartsgrense som kan være aktuell dersom andre kriterier er oppfylt"]
["5,5 - 6,0 m",2,"4,0 - 4,2 m",3,"200 - 300 m",2,null,null,"5,1 - 7 %",3,null,null,"Ubelyst",4,null,null,1,"Anbefalt fartsgrense",1,"Fartsgrense som kan være aktuell dersom andre kriterier er oppfylt",1,"Fartsgrense som kan være aktuell dersom andre kriterier er oppfylt"]
["< 5,5 m",4,"< 4,0 m",4,"< 200 m",3,null,null,"7,1 - 9 %",4,null,null,null,null,null,null,2,"Anbefalt fartsgrense",2,"Fartsgrense som kan være aktuell dersom andre kriterier er oppfylt",2,"Fartsgrense som kan være aktuell dersom andre kriterier er oppfylt"]
[null,null,null,null,null,null,null,null,"≥ 9,1 %",6,null,null,null,null,null,null,3,"Anbefalt fartsgrense",3,"Fartsgrense som kan være aktuell dersom andre kriterier er oppfylt",3,"Fartsgrense som kan være aktuell dersom andre kriterier er oppfylt"]
[null,null,null,null,null,null,null,null,null,null,null,null,null,null,null,null,4,"Anbefalt fartsgrense",4,"Fartsgrense som kan være aktuell dersom andre kriterier er oppfylt",4,"Fartsgrense som kan være aktuell dersom andre kriterier er oppfylt"]
[null,null,null,null,null,null,null,null,null,null,null,null,null,null,null,null,5,"Anbefalt fartsgrense",5,"Fartsgrense som kan være aktuell dersom andre kriterier er oppfylt",5,"Fartsgrense som kan være aktuell dersom andre kriterier er oppfylt"]
[null,null,null,null,null,null,null,null,null,null,null,null,null,null,null,null,6,"Anbefalt fartsgrense",6,"Fartsgrense som kan være aktuell dersom andre kriterier er oppfylt",6,"Fartsgrense som kan være aktuell dersom andre kriterier er oppfylt"]
[null,null,null,null,null,null,null,null,null,null,null,null,null,null,null,null,7,"Anbefalt fartsgrense",7,"Fartsgrense som kan være aktuell dersom andre kriterier er oppfylt",7,"Fartsgrense som kan være aktuell dersom andre kriterier er oppfylt"]
[null,null,null,null,null,null,null,null,null,null,null,null,null,null,null,null,8,"Anbefalt fartsgrense",8,"Fartsgrense som kan være aktuell dersom andre kriterier er oppfylt",8,"Fartsgrense som kan være aktuell dersom andre kriterier er oppfylt"]
[null,null,null,null,null,null,null,null,null,null,null,null,null,null,null,null,9,"Anbefalt fartsgrense",9,"Fartsgrense som kan være aktuell dersom andre kriterier er oppfylt",9,"Fartsgrense som kan være aktuell dersom andre kriterier er oppfylt"]
[null,null,null,null,null,null,null,null,null,null,null,null,null,null,null,null,10,"Fartsgrense som kan beholdes/benyttes etter en samlet vurdering",10,"Anbefalt fartsgrense",10,"Fartsgrense som kan være aktuell dersom andre kriterier er oppfylt"]
[null,null,null,null,null,null,null,null,null,null,null,null,null,null,null,null,11,"Fartsgrense som kan beholdes/benyttes etter en samlet vurdering",11,"Anbefalt fartsgrense",11,"Fartsgrense som kan være aktuell dersom andre kriterier er oppfylt"]
[null,null,null,null,null,null,null,null,null,null,null,null,null,null,null,null,12,"Fartsgrense som kan beholdes/benyttes etter en samlet vurdering",12,"Anbefalt fartsgrense",12,"Fartsgrense som kan være aktuell dersom andre kriterier er oppfylt"]
[null,null,null,null,null,null,null,null,null,null,null,null,null,null,null,null,13,"Fartsgrense som kan beholdes/benyttes etter en samlet vurdering",13,"Anbefalt fartsgrense",13,"Fartsgrense som kan være aktuell dersom andre kriterier er oppfylt"]
[null,null,null,null,null,null,null,null,null,null,null,null,null,null,null,null,14,"Fartsgrense som kan være aktuell dersom andre kriterier er oppfylt",14,"Fartsgrense som kan beholdes/benyttes etter en samlet vurdering",14,"Anbefalt fartsgrense"]
[null,null,null,null,null,null,null,null,null,null,null,null,null,null,null,null,15,"Fartsgrense som kan være aktuell dersom andre kriterier er oppfylt",15,"Fartsgrense som kan beholdes/benyttes etter en samlet vurdering",15,"Anbefalt fartsgrense"]
[null,null,null,null,null,null,null,null,null,null,null,null,null,null,null,null,16,"Fartsgrense som kan være aktuell dersom andre kriterier er oppfylt",16,"Fartsgrense som kan beholdes/benyttes etter en samlet vurdering",16,"Anbefalt fartsgrense"]
[null,null,null,null,null,null,null,null,null,null,null,null,null,null,null,null,17,"Fartsgrense som kan være aktuell dersom andre kriterier er oppfylt",17,"Fartsgrense som kan beholdes/benyttes etter en samlet vurdering",17,"Anbefalt fartsgrense"]
[null,null,null,null,null,null,null,null,null,null,null,null,null,null,null,null,18,"Fartsgrense som kan være aktuell dersom andre kriterier er oppfylt",18,"Fartsgrense som kan beholdes/benyttes etter en samlet vurdering",18,"Anbefalt fartsgrense"]
[null,null,null,null,null,null,null,null,null,null,null,null,null,null,null,null,19,"Fartsgrense som kan være aktuell dersom andre kriterier er oppfylt",19,"Fartsgrense som kan beholdes/benyttes etter en samlet vurdering",19,"Anbefalt fartsgrense"]
[null,null,null,null,null,null,null,null,null,null,null,null,null,null,null,null,20,"Fartsgrense som kan være aktuell dersom andre kriterier er oppfylt",20,"Fartsgrense som kan beholdes/benyttes etter en samlet vurdering",20,"Anbefalt fartsgrense"]
[null,null,null,null,null,null,null,null,null,null,null,null,null,null,null,null,21,"Fartsgrense som kan være aktuell dersom andre kriterier er oppfylt",21,"Fartsgrense som kan beholdes/benyttes etter en samlet vurdering",21,"Anbefalt fartsgrense"]
[null,null,null,null,null,null,null,null,null,null,null,null,null,null,null,null,22,"Fartsgrense som kan være aktuell dersom andre kriterier er oppfylt",22,"Fartsgrense som kan beholdes/benyttes etter en samlet vurdering",22,"Anbefalt fartsgrense"]
[null,null,null,null,null,null,null,null,null,null,null,null,null,null,null,null,23,"Fartsgrense som kan være aktuell dersom andre kriterier er oppfylt",23,"Fartsgrense som kan beholdes/benyttes etter en samlet vurdering",23,"Anbefalt fartsgrense"]
[null,null,null,null,null,null,null,null,null,null,null,null,null,null,null,null,24,"Fartsgrense som kan være aktuell dersom andre kriterier er oppfylt",24,"Fartsgrense som kan beholdes/benyttes etter en samlet vurdering",24,"Anbefalt fartsgrense"]
[null,null,null,null,null,null,null,null,null,null,null,null,null,null,null,null,25,"Fartsgrense som kan være aktuell dersom andre kriterier er oppfylt",25,"Fartsgrense som kan beholdes/benyttes etter en samlet vurdering",25,"Anbefalt fartsgrense"]
[null,null,null,null,null,null,null,null,null,null,null,null,null,null,null,null,26,"Fartsgrense som kan være aktuell dersom andre kriterier er oppfylt",26,"Fartsgrense som kan beholdes/benyttes etter en samlet vurdering",26,"Anbefalt fartsgrense"]
[null,null,null,null,null,null,null,null,null,null,null,null,null,null,null,null,27,"Fartsgrense som kan være aktuell dersom andre kriterier er oppfylt",27,"Fartsgrense som kan beholdes/benyttes etter en samlet vurdering",27,"Anbefalt fartsgrense"]
[null,null,null,null,null,null,null,null,null,null,null,null,null,null,null,null,28,"Fartsgrense som kan være aktuell dersom andre kriterier er oppfylt",28,"Fartsgrense som kan beholdes/benyttes etter en samlet vurdering",28,"Anbefalt fartsgrense"]
[null,null,null,null,null,null,null,null,null,null,null,null,null,null,null,null,29,"Fartsgrense som kan være aktuell dersom andre kriterier er oppfylt",29,"Fartsgrense som kan beholdes/benyttes etter en samlet vurdering",29,"Anbefalt fartsgrense"]
[null,null,null,null,null,null,null,null,null,null,null,null,null,null,null,null,30,"Fartsgrense som kan være aktuell dersom andre kriterier er oppfylt",30,"Fartsgrense som kan beholdes/benyttes etter en samlet vurdering",30,"Anbefalt fartsgrense"]
[null,null,null,null,null,null,null,null,null,null,null,null,null,null,null,null,31,"Fartsgrense som kan være aktuell dersom andre kriterier er oppfylt",31,"Fartsgrense som kan beholdes/benyttes etter en samlet vurdering",31,"Anbefalt fartsgrense"]
[null,null,null,null,null,null,null,null,null,null,null,null,null,null,null,null,32,"Fartsgrense som kan være aktuell dersom andre kriterier er oppfylt",32,"Fartsgrense som kan beholdes/benyttes etter en samlet vurdering",32,"Anbefalt fartsgrense"]
[null,null,null,null,null,null,null,null,null,null,null,null,null,null,null,null,33,"Fartsgrense som kan være aktuell dersom andre kriterier er oppfylt",33,"Fartsgrense som kan beholdes/benyttes etter en samlet vurdering",33,"Anbefalt fartsgrense"]
[null,null,null,null,null,null,null,null,null,null,null,null,null,null,null,null,34,"Fartsgrense som kan være aktuell dersom andre kriterier er oppfylt",34,"Fartsgrense som kan beholdes/benyttes etter en samlet vurdering",34,"Anbefalt fartsgrense"]
[null,null,null,null,null,null,null,null,null,null,null,null,null,null,null,null,35,"Fartsgrense som kan være aktuell dersom andre kriterier er oppfylt",35,"Fartsgrense som kan beholdes/benyttes etter en samlet vurdering",35,"Anbefalt fartsgrense"]
[null,null,null,null,null,null,null,null,null,null,null,null,null,null,null,null,36,"Fartsgrense som kan være aktuell dersom andre kriterier er oppfylt",36,"Fartsgrense som kan beholdes/benyttes etter en samlet vurdering",36,"Anbefalt fartsgrense"]
[null,null,null,null,null,null,null,null,null,null,null,null,null,null,null,null,37,"Fartsgrense som kan være aktuell dersom andre kriterier er oppfylt",37,"Fartsgrense som kan beholdes/benyttes etter en samlet vurdering",37,"Anbefalt fartsgrense"]
[null,null,null,null,null,null,null,null,null,null,null,null,null,null,null,null,38,"Fartsgrense som kan være aktuell dersom andre kriterier er oppfylt",38,"Fartsgrense som kan beholdes/benyttes etter en samlet vurdering",38,"Anbefalt fartsgrense"]
[null,null,null,null,null,null,null,null,null,null,null,null,null,null,null,null,39,"Fartsgrense som kan være aktuell dersom andre kriterier er oppfylt",39,"Fartsgrense som kan beholdes/benyttes etter en samlet vurdering",39,"Anbefalt fartsgrense"]
[null,null,null,null,null,null,null,null,null,null,null,null,null,null,null,null,40,"Fartsgrense som kan være aktuell dersom andre kriterier er oppfylt",40,"Fartsgrense som kan beholdes/benyttes etter en samlet vurdering",40,"Anbefalt fartsgrense"]
[null,null,null,null,null,null,null,null,null,null,null,null,null,null,null,null,41,"Fartsgrense som kan være aktuell dersom andre kriterier er oppfylt",41,"Fartsgrense som kan beholdes/benyttes etter en samlet vurdering",41,"Anbefalt fartsgrense"]
[null,null,null,null,null,null,null,null,null,null,null,null,null,null,null,null,42,"Fartsgrense som kan være aktuell dersom andre kriterier er oppfylt",42,"Fartsgrense som kan beholdes/benyttes etter en samlet vurdering",42,"Anbefalt fartsgrense"]
[null,null,null,null,null,null,null,null,null,null,null,null,null,null,null,null,43,"Fartsgrense som kan være aktuell dersom andre kriterier er oppfylt",43,"Fartsgrense som kan beholdes/benyttes etter en samlet vurdering",43,"Anbefalt fartsgrense"]
[null,null,null,null,null,null,null,null,null,null,null,null,null,null,null,null,44,"Fartsgrense som kan være aktuell dersom andre kriterier er oppfylt",44,"Fartsgrense som kan beholdes/benyttes etter en samlet vurdering",44,"Anbefalt fartsgrense"]
[null,null,null,null,null,null,null,null,null,null,null,null,null,null,null,null,45,"Fartsgrense som kan være aktuell dersom andre kriterier er oppfylt",45,"Fartsgrense som kan beholdes/benyttes etter en samlet vurdering",45,"Anbefalt fartsgrense"]
[null,null,null,null,null,null,null,null,null,null,null,null,null,null,null,null,46,"Fartsgrense som kan være aktuell dersom andre kriterier er oppfylt",46,"Fartsgrense som kan beholdes/benyttes etter en samlet vurdering",46,"Anbefalt fartsgrense"]
[null,null,null,null,null,null,null,null,null,null,null,null,null,null,null,null,47,"Fartsgrense som kan være aktuell dersom andre kriterier er oppfylt",47,"Fartsgrense som kan beholdes/benyttes etter en samlet vurdering",47,"Anbefalt fartsgrense"]
[null,null,null,null,null,null,null,null,null,null,null,null,null,null,null,null,48,"Fartsgrense som kan være aktuell dersom andre kriterier er oppfylt",48,"Fartsgrense som kan beholdes/benyttes etter en samlet vurdering",48,"Anbefalt fartsgrense"]
[null,null,null,null,null,null,null,null,null,null,null,null,null,null,null,null,49,"Fartsgrense som kan være aktuell dersom andre kriterier er oppfylt",49,"Fartsgrense som kan beholdes/benyttes etter en samlet vurdering",49,"Anbefalt fartsgrense"]
[null,null,null,null,null,null,null,null,null,null,null,null,null,null,null,null,50,"Fartsgrense som kan være aktuell dersom andre kriterier er oppfylt",50,"Fartsgrense som kan beholdes/benyttes etter en samlet vurdering",50,"Anbefalt fartsgrense"]
[null,null,null,null,null,null,null,null,null,null,null,null,null,null,null,null,51,"Fartsgrense som kan være aktuell dersom andre kriterier er oppfylt",51,"Fartsgrense som kan beholdes/benyttes etter en samlet vurdering",51,"Anbefalt fartsgrense"]
[null,null,null,null,null,null,null,null,null,null,null,null,null,null,null,null,52,"Fartsgrense som kan være aktuell dersom andre kriterier er oppfylt",52,"Fartsgrense som kan beholdes/benyttes etter en samlet vurdering",52,"Anbefalt fartsgrense"]
[null,null,null,null,null,null,null,null,null,null,null,null,null,null,null,null,53,"Fartsgrense som kan være aktuell dersom andre kriterier er oppfylt",53,"Fartsgrense som kan beholdes/benyttes etter en samlet vurdering",53,"Anbefalt fartsgrense"]
[null,null,null,null,null,null,null,null,null,null,null,null,null,null,null,null,54,"Fartsgrense som kan være aktuell dersom andre kriterier er oppfylt",54,"Fartsgrense som kan beholdes/benyttes etter en samlet vurdering",54,"Anbefalt fartsgrense"]
[null,null,null,null,null,null,null,null,null,null,null,null,null,null,null,null,55,"Fartsgrense som kan være aktuell dersom andre kriterier er oppfylt",55,"Fartsgrense som kan beholdes/benyttes etter en samlet vurdering",55,"Anbefalt fartsgrense"]
[null,null,null,null,null,null,null,null,null,null,null,null,null,null,null,null,56,"Fartsgrense som kan være aktuell dersom andre kriterier er oppfylt",56,"Fartsgrense som kan beholdes/benyttes etter en samlet vurdering",56,"Anbefalt fartsgrense"]
[null,null,null,null,null,null,null,null,null,null,null,null,null,null,null,null,57,"Fartsgrense som kan være aktuell dersom andre kriterier er oppfylt",57,"Fartsgrense som kan beholdes/benyttes etter en samlet vurdering",57,"Anbefalt fartsgrense"]
[null,null,null,null,null,null,null,null,null,null,null,null,null,null,null,null,58,"Fartsgrense som kan være aktuell dersom andre kriterier er oppfylt",58,"Fartsgrense som kan beholdes/benyttes etter en samlet vurdering",58,"Anbefalt fartsgrense"]
[null,null,null,null,null,null,null,null,null,null,null,null,null,null,null,null,59,"Fartsgrense som kan være aktuell dersom andre kriterier er oppfylt",59,"Fartsgrense som kan beholdes/benyttes etter en samlet vurdering",59,"Anbefalt fartsgrense"]
[null,null,null,null,null,null,null,null,null,null,null,null,null,null,null,null,60,"Fartsgrense som kan være aktuell dersom andre kriterier er oppfylt",60,"Fartsgrense som kan beholdes/benyttes etter en samlet vurdering",60,"Anbefalt fartsgrense"]